Piensa Technologies

  >  Foro de Principiantes en Linux - Mensaje
Indice del Foro 
Búsqueda 
 
Búsqueda Especializada  
 
Ingresar  
Nuevo Mensaje al Foro  
 
 Acerca de Linux
La Gaceta de Linux 
Edición en español 
Gazeta do Linux 
Edición en portugués 
Foro de Principiantes 
> Mensaje
modem intel
Ingresado por pako el día viernes junio 10, @05:48 .
Tema: [ Linux en General ]

como instalo el modem. me aparece los siguientes errores. ayudenme porfa
linux:/home/pako/modem # make install if [ -a /boot/vmlinuz.version.h ]; then \ cp /boot/vmlinuz.version.h /lib/modules/`uname -r`/build/include/linux/v ersion.h; fi if [ ]; then \ cd coredrv; make TARGET=TARGET_CATAWBA KERNEL_INCLUDES=/include "PSTN_DE F=-DTARGET_CATAWBA -DTARGET_LINUX -DLINUX" 537core; \ cd ../serialdrv; make TARGET=TARGET_CATAWBA KERNEL_INCLUDES=/include card=CARD_T J320 \ "PSTN_DEF=-DTARGET_CATAWBA -DTARGET_LINUX -DLINUX" 537; \ else \ cd coredrv; make TARGET=TARGET_CATAWBA KERNEL_INCLUDES=/lib/modules/`unam e -r`/build/include \ "PSTN_DEF=-DTARGET_CATAWBA -DTARGET_LINUX -DLINUX" 537core; \ cd ../serialdrv; make TARGET=TARGET_CATAWBA KERNEL_INCLUDES=/lib/modules /`uname -r`/build/include card=CARD_TJ320 \ "PSTN_DEF=-DTARGET_CATAWBA -DTARGET_LINUX -DLINUX" 537; \ fi ; make[1]: Entering directory `/home/pako/modem/coredrv' cc -DTARGET_CATAWBA -DTARGET_LINUX -DLINUX -Wall -O -I /lib/modules/2.6.8-24-def ault/build/include -I../inc -c -o coredrv.o coredrv.c In file included from /usr/include/linux/list.h:7, from /usr/include/linux/wait.h:14, from /usr/include/asm/semaphore.h:41, from /usr/include/linux/sched.h:18, from coredrv.c:35: /usr/include/linux/prefetch.h: In function `prefetch_range': /usr/include/linux/prefetch.h:64: error: `CONFIG_X86_L1_CACHE_SHIFT' undeclared (first use in this function) /usr/include/linux/prefetch.h:64: error: (Each undeclared identifier is reported only once /usr/include/linux/prefetch.h:64: error: for each function it appears in.) In file included from /usr/include/linux/module.h:22, from coredrv.c:37: /usr/include/asm/module.h:56:2: #error unknown processor family In file included from /usr/include/linux/irq.h:20, from /usr/include/asm/hardirq.h:6, from /usr/include/linux/interrupt.h:12, from /usr/include/linux/serialP.h:26, from coredrv.c:42: /usr/include/asm/irq.h:16:25: irq_vectors.h: No such file or directory In file included from /usr/include/asm/hardirq.h:6, from /usr/include/linux/interrupt.h:12, from /usr/include/linux/serialP.h:26, from coredrv.c:42: /usr/include/linux/irq.h: At top level: /usr/include/linux/irq.h:68: error: `CONFIG_X86_L1_CACHE_SHIFT' undeclared here (not in a function) /usr/include/linux/irq.h:68: error: requested alignment is not a constant /usr/include/linux/irq.h:70: error: `NR_IRQS' undeclared here (not in a function ) In file included from /usr/include/linux/irq.h:72, from /usr/include/asm/hardirq.h:6, from /usr/include/linux/interrupt.h:12, from /usr/include/linux/serialP.h:26, from coredrv.c:42: /usr/include/asm/hw_irq.h:28: error: `NR_IRQ_VECTORS' undeclared here (not in a function) /usr/include/asm/hw_irq.h:32: error: `NR_IRQS' undeclared here (not in a functio n) In file included from /usr/include/linux/interrupt.h:12, from /usr/include/linux/serialP.h:26, from coredrv.c:42: /usr/include/asm/hardirq.h:13: error: `CONFIG_X86_L1_CACHE_SHIFT' undeclared her e (not in a function) /usr/include/asm/hardirq.h:13: error: requested alignment is not a constant coredrv.c:72: warning: conflicting types for built-in function `putchar' coredrv.c: In function `get_pci_info_537': coredrv.c:197: warning: return makes pointer from integer without a cast coredrv.c: In function `open': coredrv.c:282: warning: passing arg 2 of `request_irq' from incompatible pointer type coredrv.c:242: warning: unused variable `phy_mem_start' coredrv.c:243: warning: unused variable `phy_mem_len' coredrv.c: In function `schedule_background_event': coredrv.c:467: warning: implicit declaration of function `queue_task' coredrv.c:467: error: structure has no member named `tqueue' coredrv.c:467: error: `tq_immediate' undeclared (first use in this function) coredrv.c:468: warning: implicit declaration of function `mark_bh' coredrv.c:468: error: `IMMEDIATE_BH' undeclared (first use in this function) make[1]: *** [coredrv.o] Error 1 make[1]: Leaving directory `/home/pako/modem/coredrv' make[1]: Entering directory `/home/pako/modem/serialdrv' cc -DTARGET_CATAWBA -DTARGET_LINUX -DLINUX -Wall -O -I /lib/modules/2.6.8-24-def ault/build/include -I ../inc -c -o softserial.o softserial.c In file included from /usr/include/linux/list.h:7, from /usr/include/linux/wait.h:14, from /usr/include/asm/semaphore.h:41, from /usr/include/linux/sched.h:18, from /usr/include/linux/module.h:9, from softserial.h:52, from softserial.c:38: /usr/include/linux/prefetch.h: In function `prefetch_range': /usr/include/linux/prefetch.h:64: error: `CONFIG_X86_L1_CACHE_SHIFT' undeclared (first use in this function) /usr/include/linux/prefetch.h:64: error: (Each undeclared identifier is reported only once /usr/include/linux/prefetch.h:64: error: for each function it appears in.) In file included from /usr/include/linux/module.h:22, from softserial.h:52, from softserial.c:38: /usr/include/asm/module.h:56:2: #error unknown processor family In file included from /usr/include/linux/irq.h:20, from /usr/include/asm/hardirq.h:6, from /usr/include/linux/interrupt.h:12, from /usr/include/linux/serialP.h:26, from softserial.h:55, from softserial.c:38: /usr/include/asm/irq.h:16:25: irq_vectors.h: No such file or directory In file included from /usr/include/asm/hardirq.h:6, from /usr/include/linux/interrupt.h:12, from /usr/include/linux/serialP.h:26, from softserial.h:55, from softserial.c:38: /usr/include/linux/irq.h: At top level: /usr/include/linux/irq.h:68: error: `CONFIG_X86_L1_CACHE_SHIFT' undeclared here (not in a function) /usr/include/linux/irq.h:68: error: requested alignment is not a constant /usr/include/linux/irq.h:70: error: `NR_IRQS' undeclared here (not in a function ) In file included from /usr/include/linux/irq.h:72, from /usr/include/asm/hardirq.h:6, from /usr/include/linux/interrupt.h:12, from /usr/include/linux/serialP.h:26, from softserial.h:55, from softserial.c:38: /usr/include/asm/hw_irq.h:28: error: `NR_IRQ_VECTORS' undeclared here (not in a function) /usr/include/asm/hw_irq.h:32: error: `NR_IRQS' undeclared here (not in a functio n) In file included from /usr/include/linux/interrupt.h:12, from /usr/include/linux/serialP.h:26, from softserial.h:55, from softserial.c:38: /usr/include/asm/hardirq.h:13: error: `CONFIG_X86_L1_CACHE_SHIFT' undeclared her e (not in a function) /usr/include/asm/hardirq.h:13: error: requested alignment is not a constant softserial.c: In function `init_module': softserial.c:60: warning: implicit declaration of function `pci_present' softserial.c: In function `softserial_register_tty': softserial.c:99: warning: assignment makes integer from pointer without a cast softserial.c:100: error: structure has no member named `table' softserial.c: In function `softserial_open': softserial.c:161: error: `MOD_IN_USE' undeclared (first use in this function) softserial.c:163: warning: `MOD_INC_USE_COUNT' is deprecated (declared at /usr/i nclude/linux/module.h:554) softserial.c:167: warning: `MOD_INC_USE_COUNT' is deprecated (declared at /usr/include/linux/module.h:554) softserial.c:169: error: structure has no member named `device' softserial.c:169: error: request for member `minor_start' in something not a structure or union softserial.c:177: error: structure has no member named `normal_termios' softserial.c:187: error: structure has no member named `tqueue' softserial.c:188: error: structure has no member named `tqueue' softserial.c:189: error: structure has no member named `session' softserial.c:189: error: structure has no member named `session' softserial.c:190: error: structure has no member named `pgrp' softserial.c:190: error: structure has no member named `pgrp' softserial.c:205: warning: `MOD_DEC_USE_COUNT' is deprecated (declared at /usr/include/linux/module.h:566) softserial.c: In function `softserial_close': softserial.c:222: error: `MOD_IN_USE' undeclared (first use in this function) softserial.c:224: warning: `MOD_DEC_USE_COUNT' is deprecated (declared at /usr/include/linux/module.h:566) softserial.c:233: warning: `MOD_DEC_USE_COUNT' is deprecated (declared at /usr/include/linux/module.h:566) make[1]: *** [softserial.o] Error 1 make[1]: Leaving directory `/home/pako/modem/serialdrv' make: *** [537] Error 2 linux:/home/pako/modem #

[ Ingresar Comentario ]

<  |  >

Relacionado
  • Más acerca de Linux en General
  • Mismo autor pako
  • Contacto con el autor